Opirip Uncaught Error 28

RECOMMENDED: If you have Windows errors then we strongly recommend that you download and run this (Windows) Repair Tool.

Nov 28, 2008. 28. What are the usage of SAVEPOINTS value in a session before. will at least know where they come from: OPIRIP: Uncaught error 447.

Redefinition Error In C Solved: Hi: I have a few source code with c++11 fetures, but when I use the. include/c++/4.5.2nested_exception.h:122:61: error: redefinition of. PAWHUSKA, Okla. -The Osage Nation has voted to change the definition of marriage in an election that drew an overwhelming number of absentee ballots. The tribe will now define marriage as a union between “two

We are getting ORA-28 in alert log." ORA-28 ALTER DATABASE BACKUP CONTROLFILE. ORA-00205: error in identifying control file,

The court also held that, given the finding that Webber had not violated the personnel rule, the “board’s finding to the contrary was legal error.” Further, the court ruled that the board’s decision “improperly applied the relevant rule.

Thu Feb 24 09:33:28 2011 Process J000 died, see its trace file kkjcre1p:. OPIRIP: Uncaught error 447. Error stack: ORA-00447: fatal error in background process

Conger was charged with an error, and replays were inconclusive as to whether he applied a tag. "It was kind of a boneheaded thing on my part," Conger said. "I thought I heard, ‘Yes, yes,’ and he was throwing up the safe sign. It was.

Apr 10, 2017. print? 1. ORA-12012: error on auto execute of job "SYS". oracle/12215.1: 2016/04/13.14:10:28 (amh) don't preserve previous mh automount state oracle/ 12215.1:. OPIRIP: Uncaught error 27102. Error stack: 05.

I am trying to use 'connect' to get value from template reducer I am facing the error below: Uncaught ReferenceError: ReservationCard is not defined Here is the.

Benson, the first thing you want to do is to reload your OS from scratch. Check on here for more information on that. Also, check BlackBerry curve 8320 App Error 523.

OPIRIP: Uncaught error 28. | Oracle Community – Jan 06, 2010  · . OPIRIP: Uncaught error 28. onkar.nath Jan 6, 2010 9:43 AM (in response to asifkabirdba) thanks Asif. Like Show 0 Likes; Actions ; 3. Re: OPIRIP: Uncaught.

I am trying to implement simpleWeather.js on my website. Unfortunately, when I place the html in my website, I get Uncaught TypeError: $.simpleWeather is not a.

The deck is dwindling, but the jackpot — and the crowds — are growing. The Chase the Ace grand prize of $477,700 went unclaimed Wednesday, after people streamed by the hundreds into Goulds for a shot at the jackpot. The lottery is a.

Sep 29, 2013. UDE-31623: operation generated ORACLE error 31623. Version: #1 SMP Wed Aug 21 14:28:36 PDT 2013. OPIRIP: Uncaught error 447.

2008年7月17日. Died during process startup with error 20 (seq=14510). OPIRIP: Uncaught error 20. Error stack: ORA-00020:. Wed Apr 26 21:28:21 2006.

16 พ.ค. 2014. สรุปก็คือ คำสั่งไม่เกิด Error ใดๆ แต่ UNDO tablespace และ database file จะไม่ถูกสร้าง.. เขียนโดย Surachart. เขียนโดย Surachart Opun ที่ 00:28 ไม่มีความคิดเห็น: · ส่งอีเมล ข้อมูลนี้BlogThis!. OPIRIP: Uncaught error 108. Error stack:

RECOMMENDED: Click here to fix Windows errors and improve system performance

Categories: KB

Steam Error Invalid Drive H

RECOMMENDED: If you have Windows errors then we strongly recommend that you download and run this (Windows) Repair Tool.

Fix logical error in stm32_spi_prepare_mbr() scsi: hpsa: Fix configured_logical_drive_count·check Colin Ian King (1): e1000: avoid null pointer dereference on invalid stat type Cong Wang (15): net_sched: avoid matching qdisc with zero.

Opirip Uncaught Error 28 Nov 28, 2008. 28. What are the usage of SAVEPOINTS value in a session before. will at least know where they come from: OPIRIP: Uncaught error 447. Redefinition Error In C Solved: Hi: I have a few source code with c++11 fetures, but when I use the. include/c++/4.5.2nested_exception.h:122:61: error: redefinition of. PAWHUSKA, Okla. -The Osage

Invalid drive error when installing your fav program? I go though how to solve this issue right here. Is it not just the worst when you're trying to.

This is a list of defunct automobile manufacturers of the United States. They were discontinued for various reasons, such as bankruptcy of the parent company, mergers.

Probe Failed With Error 22 Not to mention all the amenities, which include space for a recording studio, a media room, an in-house spa and separate living quarters for their staff. Casual. And. Aug 26, 2011. The problem is that the driver's probe callback never gets called. dmesg just. generic-usb: probe of 0003:099A:2620.000F failed with error -22. Oct 30, 2015.

Ayumilove Post author November 2, 2017 at 9:56 AM @Timm: (BLACK SCREEN MAPLESTORY RUNNING ON STEAM) If it’s black screen, could you wait like 5.

Power Engineering – The department said in a notice in the April 9 Pennsylvania Bulletin that the facility is designed to generate up to 450 MW (nominal) using a combustion turbine generator and a heat recovery steam generator that will provide steam to drive a.

Error 1327 Invalid Drive : FIXED 100% Working : Errors are inevitable arising from nowhere and anyone can face these errors at anytime.Some Errors may prove to be.

Tangible media include, but are not limited to, any tape disk, compact disk, card, flash drive, USB drive. on any other occasion. h. Severability. If any provision of the Terms is, for any reason, held to be invalid or unenforceable, the other.

My friend is trying to install steam but gets this message every time http://i155.photobucket.com/albums/s315/moonman741/untitled-1.jpg Anyone wanna help?

SmartPCFixer™ is a fully featured and easy-to-use system optimization suite. With it, you can clean windows registry, remove cache files, fix errors, defrag disk.

Our Discussion Boards feature has been discontinued. Amazon would like to thank the members of this community for contributing to the discussion forums.

What is “Free-Range Kids”? You have been dubbed “America’s Worst Mom” by the media. How did you earn this title? Were you a Free Range kid?

View and Download Midea RSJ-420/PZN1-H technical manual online. R410A Direct Heating Commercial Heat Pump 50Hz. RSJ-420/PZN1-H Heat.

So, we know Fox has a knack for pulling victory from the jaws of defeat with a game plan that would look best on the 1926 Providence Steam Roller. Keenum is a.

Steam-age General Motors has now beaten Musk to market with the. He could have been the NFL’s best-ever H-back. At age 30, maybe he still could be.

Everyone has their favorites 800-pound app suites (Adobe, I’m looking at you), massive Steam libraries, obscure utilities, desktop doodads, and other ephemera woven into a boot drive tapestry that. Use Sysprep.exe /h for a list of options.

RECOMMENDED: Click here to fix Windows errors and improve system performance

Categories: KB

Probe Failed With Error 22

RECOMMENDED: If you have Windows errors then we strongly recommend that you download and run this (Windows) Repair Tool.

Not to mention all the amenities, which include space for a recording studio, a media room, an in-house spa and separate living quarters for their staff. Casual. And.

Aug 26, 2011. The problem is that the driver's probe callback never gets called. dmesg just. generic-usb: probe of 0003:099A:2620.000F failed with error -22.

Oct 30, 2015. qmi_wwan fails with error -22. qmi_wwan: probe of 2-6:1.4 failed with error -22 > echo "03f0 581d" >/sys/bus/usb/drivers/qmi_wwan/new_id.

How do I fix a connection refused error in FileZilla. – New user – trying to upload initial files and getting this error msg – Status: Connecting to 76.189.214.113:21. Status: Connection attempt failed with "ECONNREFUSED.

Ross may have violated disclosure rules if he intentionally failed to disclose.

The loss of the Mars probe was the latest in a series of major spaceflight. "I think the problem was that our systems designed to recognize and correct human error failed us. "We don’t see any connection between this failure and.

Lawyers for Home Capital Group Inc. appeared before the Ontario Securities Commission in Toronto on Thursday, the first hearing in a proceeding by the provincial.

Can you manually issue a web response and further troubleshoot the issue? You can use Fiddler to help see what is happening. Also, using wfetch can help.

Opirip Uncaught Error 28 Nov 28, 2008. 28. What are the usage of SAVEPOINTS value in a session before. will at least know where they come from: OPIRIP: Uncaught error 447. Redefinition Error In C Solved: Hi: I have a few source code with c++11 fetures, but when I use the. include/c++/4.5.2nested_exception.h:122:61: error: redefinition of. PAWHUSKA, Okla. -The Osage

Building a Venus-hardy probe poses unique challenges, and a lot of folks are working on it. Another team at NASA, unrelated to AREE, is currently building computer.

22 at the group’s Shonan plant in Kanagawa Prefecture. Prefecture to see whether Nissan is taking action on reforms to prevent a recurrence. The probe broadens.

Broadened Wettlaufer probe urged | The London Free Press – Nov 03, 2017  · Start your day with The London Free Press. Choose among a variety of subscription packages and stay up to date with convenient home delivery and our.

(un-)registration fails, without propagating the error code. This can lead # stap -e ‘probe kernel.function("cmdline_proc_show. error message stating that (kprobe) registration had failed (because.

Windows System Error Codes (exit. 1016 An I/O operation initiated by the registry failed. 14020 The private manifest probe has crossed the.

Connect Error 183 Beathard did connect with Marquise Goodwin for 48 yards on a nice slant. This approach leaves little margin for error against more explosive offenses, but the. IEEE Spectrum – The Consumer Technology Association estimated that residents of the United States bought 183 million smartphones in 2016. Sometimes it’s easy to see that a connection has

The remote server returned an error: (404) Not Found [Answered] RSS. 11 replies. 22. n n i DYNAMIC_COMPRESSION_END 21:53:41.186

Redefinition Error In C Solved: Hi: I have a few source code with c++11 fetures, but when I use the. include/c++/4.5.2nested_exception.h:122:61: error: redefinition of. PAWHUSKA, Okla. -The Osage Nation has voted to change the definition of marriage in an election that drew an overwhelming number of absentee ballots. The tribe will now define marriage as a union between “two

Three prominent senators excoriated the U.S. Air Force on Tuesday for its failure.

The newest probe is being handled by the Federal Reserve Bank of San Francisco, the Times reports, and it involves guaranteed auto protection insurance, which “is.

Jun 4, 2015. error and warning message may not be available or. creation will result in the device probe function. [email protected] failed with error -22.

The U.S. Air Force failed to report the Texas church gunman’s 2012 domestic.

RECOMMENDED: Click here to fix Windows errors and improve system performance

Categories: KB

Redefinition Error In C

RECOMMENDED: If you have Windows errors then we strongly recommend that you download and run this (Windows) Repair Tool.

Solved: Hi: I have a few source code with c++11 fetures, but when I use the. include/c++/4.5.2nested_exception.h:122:61: error: redefinition of.

PAWHUSKA, Okla. -The Osage Nation has voted to change the definition of marriage in an election that drew an overwhelming number of absentee ballots. The tribe will now define marriage as a union between “two persons” rather.

Feb 15, 2012. I have started using multiple *.c-files and therefore multiple *.h-files in my. get CCS error messages like: symbol "uint16_globaltest" redefined:.

Error place in api: #define DLLEXPORT extern "C" __declspec(dllexport) DLLEXPORT int CAnyseeUSBTVControllerDlg::InitCaptureDevice() { In my.h library class and.

669,444. People signed the C4M national petition against the redefinition of marriage.

In this case, there are two global variables with the same name: var. One is defined within the namespace first and the other one in second. No redefinition errors happen thanks to namespaces.

Redefinition errors in.h files. Without this, if the header is included multiple times from various sources you get errors relating to redefinition.

You can't redefine the same symbol in two different header files. Remove one of the typedef struct node. – Eregrith Jun 12 '15 at 8:20

This is an error unfortunately I've not had the joy of debugging before, so I'm not sure what's going on with this one. Here is the list of errors I'm receiving:

Connect Error 183 Beathard did connect with Marquise Goodwin for 48 yards on a nice slant. This approach leaves little margin for error against more explosive offenses, but the. IEEE Spectrum – The Consumer Technology Association estimated that residents of the United States bought 183 million smartphones in 2016. Sometimes it’s easy to see that a connection has

May 22, 2016. Compiling the code above gives the following error:. order : Right Click the Project -> Properties -> C/C++ -> Advanced -> Show Includes.

Managing tables includes tasks such as creating tables, loading tables, altering tables, and dropping tables.

Error Message; Compiler Error C3500: invalid ProgID ‘progid’ Compiler Error C3501: there is no typelib registered for ProgID ‘progid’ Compiler Error C3502

If you have documentation that shows additional device codes and/or error codes, please forward them to the e-mail address listed at the bottom of this article.

A committee of the International Committee for Weights and Measures (CIPM) has proposed revised formal definitions of the SI base units, which are being examined by.

Like the hubbub it set off, HB2’s origin story is not confined to North Carolina: It starts in the same busy corner of D.C.’s bureaucratic jungle. Now, these proposed state laws won’t undo the federal redefinition of gender as an identity.

To achieve such sensitivity, their machines need to be isolated from any external vibrations and maintained at a temperature that is steady to within 0.1 °C. And to measure the. of metrologists working on a redefinition. The.

Ban on Residential Expansion In Coney Island Area Enacted – The change was in the form of a tighter redefinition of C‐7 Zoning rather than in a formal rezoning. We are continually improving the quality of our text archives. Please send feedback, error reports, and suggestions to.

Published in U.S. WASHINGTON, D.C. (Catholic Standard) – Even though the Archdiocese of Washington has opposed the redefinition of marriage. is smoke there are probably also mirrors." This media misinformation related to this.

RECOMMENDED: Click here to fix Windows errors and improve system performance

Categories: KB

Connect Error 183

RECOMMENDED: If you have Windows errors then we strongly recommend that you download and run this (Windows) Repair Tool.

Beathard did connect with Marquise Goodwin for 48 yards on a nice slant. This approach leaves little margin for error against more explosive offenses, but the.

IEEE Spectrum – The Consumer Technology Association estimated that residents of the United States bought 183 million smartphones in 2016. Sometimes it’s easy to see that a connection has come loose or that a capacitor has gone bad, but for the.

Troubleshooting Infinity Connect error messages – Pexip Docs – Troubleshooting Infinity Connect error messages. The table. #pex183. Screenshare error, Screenshare error, Something went wrong with screenshare. Please.

original title: error code 8024001F I am being told that there is an error 8024001F, and to put disc in laptop so that I can re-introduce the Ethernet. I don’t have a.

STANDARD OF REVIEW “When reviewing a denial of a § 2255 motion, we review factual findings for clear error and conclusions of law de novo.” United States v. Williamson, 183 F.3d 458. claimed that Anderson had no connection.

FTP server return codes always have three digits, and each digit has a special meaning. Even some "permanent" error conditions can be corrected, so the human user may want to. Replies referring to the control and data connections.

Connect Error 183 Google Maps. See Versioning ebooks and technical articles on SharePoint. Except as otherwise noted, the content of this page is licensed under the.

Shares of Alibaba opened at a record high on Thursday, but were down 1.1% to.

Underlying Dbms Error Ora-00923 Install Error Title This seems a big topic, so I’ll try to clarify the procedure (19 Feb 2015) If you are getting the above error during the install of Sony Vegas ( I got it when. Title update failed to install? – Help & Support – GTAForums – Page 1 of 3 – Title update

Net cash used in operating activities during the third quarter was $243 million including cash payments of $183 million for debt interest. By eliminating the element of human error from the connection makeup and validation processes, the.

failed to create dump file error 183 – League of Legends. – For League of Legends on the PC, a GameFAQs message board topic titled "failed to create dump file error 183".

I'm using xendesktop 4.0 express edition after creating the desktop group I'm able to connect to desktop group within local lan through citrix online plug.

Connectionism. Connectionism is an approach to the study of human cognition that utilizes mathematical models, known as connectionist networks or artificial neural.

Oct 1, 2014. Case-1: You have already connected Brother printer to your PC. In this case, you need to uninstall the drivers and then re-install in order to.

Google Maps Connect Error 183. från GoogleLogga inDolda fältSök efter grupper eller meddelanden. from GoogleSign inHidden fieldsBooksbooks.google.com – What's.

Trial And Error Lyrics Nightingale Entertainment – ABC News – Get up to the minute entertainment news, celebrity interviews, celeb videos, photos, movies, TV, music news and pop culture on ABCNews.com. WAVVES and Culture Abuse collaborated for “Up And Down,” a two minute burst of garage pop with punchy lyrics. MisterWives – “Never. act One Flew West released their new

SSL Certificate add failed, Error: 183 Cannot create a file when that file already exists. This happens when doing NETSH HTTP ADD SSLCERT. Sunday,

I am new to informatica and looking for assistance from available experts. I am able to login to admin console (http://localhost:6008/administrator/#admin) where I.

Home > Connect Error > Connect Error 183 Google Maps Connect Error 183 Google Maps. PA348&dq=connect+error+183+google+maps. connect-error/connect.

Issuu is a digital publishing platform that makes it simple to publish magazines, catalogs, newspapers, books, and more online. Easily share your publications and get.

RECOMMENDED: Click here to fix Windows errors and improve system performance

Categories: KB

Ford Taurus Fuel Error

RECOMMENDED: If you have Windows errors then we strongly recommend that you download and run this (Windows) Repair Tool.

Documentation from Ford (PDF) submitted to the NHTSA said that the vehicles were all built at the company’s Chicago Auto Assembly plant. Some of the fuel tanks may have been manufactured with “inadequate” pressure, resulting in a.

Sep 08, 2012  · A friend of mines girlfriend posted this on FB today. What does it mean, so I can maybe help her out?

taurus service manuals – Manuals for all Ford models – Over 40,000 repair & owner manuals. Manuals for all Ford models.

What does fuel comp error mean on a ford taurus 2005 3.0liter – Answered by a verified Ford Mechanic

Ford said it would replace fuel-pump control modules in about 88,151 vehicles, including certain of its 2013-15 model year Ford Taurus sedans, Ford Flex crossover utility vehicles, Lincoln MKS sedans, Lincoln MKT SUVs and Ford Police.

What is the cause of this issue? is it the main computer that needs to be reset or is it a computer sensor in the tank itself. The dealer nor For.

Whirlpool Gold Oven Error Code E1 F5 Whirlpool Range / Stove / Oven Fault Codes. Whirlpool Duet Front Loading Gas and Electric Dryer Fault Codes. F5 – E1, Self clean latch will not lock. F5 – E2. Spss 19 Error 7001 Symptom 18 African Journal of Biotechnology – 3 April, 2012 Issue by. – Issuu is a digital publishing platform that makes

I have a 2006 Ford Taurus 3.0L with the Vulcan engine. By the way, I had a tune up today and had the fuel filter, spark plugs, spark plug wires.

What is the cause of this issue? is it the main computer that needs to be reset or is it a computer sensor in the tank itself. The dealer nor For.

. 2013 models to check for fuel tank leaks that could result in a fire. The automaker said it won’t have enough replacement parts for all owners until September. Models include the 2013 Ford Fusion, Flex, Explorer, Taurus,

"fuel Comp Error" – Maintenance & Repair – Taurus &. – Sep 08, 2012  · A friend of mines girlfriend posted this on FB today. What does it mean, so I can maybe help her out?

Hi, I have a 2005 ford taurus and am experiencing the fule level error message. This error is causing the check engine light to turn off. I have ad.

fuel gauge not working,always reads empty,wondering if there might be a fuse. Asked by 04dyna Aug 16, 2014 at 02:40 PM about the 2000 Ford Taurus SE. you have a sender problem, it it don't then you have a gauge or IC circuit trouble.

Jan 28, 2010. I have found what I think is your problem. There is a sensor in your car called a slash sensor its ether under the dash or in some its in the right.

Fuel Level Error – 2005 Ford Taurus – RepairPal.com – Hi, I have a 2005 ford taurus and am experiencing the fule level error message. This error is causing the check engine light to turn off. I have ad.

What does fuel comp error mean on a ford taurus 2005 3.0liter – Answered by a verified Ford Mechanic

I have a 2004 Ford. I have a 2004 Ford Taurus 3.0L V6 SOHC flex fuel.I am having trouble with my fuel gauge.It will read properly for awhile then shoot right to.

2005 ford taurus: time to time the. I have a 2005 ford taurus that from time to time the gas gauge shows empty and an error message shows fuel comp error ,

Install Error Title This seems a big topic, so I’ll try to clarify the procedure (19 Feb 2015) If you are getting the above error during the install of Sony Vegas ( I got it when. Title update failed to install? – Help & Support – GTAForums – Page 1 of 3 – Title update failed to install?

2005 Ford Taurus SE.I am getting Code is P0462. Fuel level sensor A has low input. How do I fix? Fuel gauge keeps dropping to Empty.

RECOMMENDED: Click here to fix Windows errors and improve system performance

Categories: KB

Trial And Error Lyrics Nightingale

RECOMMENDED: If you have Windows errors then we strongly recommend that you download and run this (Windows) Repair Tool.

Entertainment – ABC News – Get up to the minute entertainment news, celebrity interviews, celeb videos, photos, movies, TV, music news and pop culture on ABCNews.com.

WAVVES and Culture Abuse collaborated for “Up And Down,” a two minute burst of garage pop with punchy lyrics. MisterWives – “Never. act One Flew West released their new single, “Trial And Error,” from their new EP due out.

NIGHTINGALE Lyrics – A selection of 58 Nightingale lyrics including Trial And Error, Trust, Still In The Dark, To The End, Return To Fantasy.

I just pick up my guitar and through trial and error write songs." The unique sound also comes. and found himself rewriting lyrics because of his son. "I don’t want.

AOL Radio is powered by humans! Great radio is all about unexpected connections–the kind that an algorithm can’t predict. Pick any station in any of the 30 genres.

Underlying Dbms Error Ora-00923 Install Error Title This seems a big topic, so I’ll try to clarify the procedure (19 Feb 2015) If you are getting the above error during the install of Sony Vegas ( I got it when. Title update failed to install? – Help & Support – GTAForums – Page 1 of 3 – Title update

Nightingale – Trial And Error – YouTube – Album: White Darkness Year: 2007 Band: Nightingale Lyrics" It's the way you behave and the things that you say It' the twinkle of frustration in your eyes.

Nightingale – To My Inspiration Lyrics. All my life You have been here beside me Through the days and nights We were as one Now you're gone I'm sorry that I couldn't.

Petty’s economical approach to songwriting — evocative but never flowery lyrics, sharp melodies. and then became a.

VOCAL MUSIC WITH CDs I. For male or female singers and all vocal soloists, these reviewed collections contain the printed music as well as CD accompaniment, for.

Issuu is a digital publishing platform that makes it simple to publish magazines, catalogs, newspapers, books, and more online. Easily share your publications and get.

because I just pretty much spent a year of trial and error having no idea how to.

Home > trial and > trial and error lyrics nightingale Trial And Error Lyrics Nightingale. Nightingale Correct Print Comment Tweet Trial And Error Video: Lyrics to.

Ford Taurus Fuel Error Documentation from Ford (PDF) submitted to the NHTSA said that the vehicles were all built at the company’s Chicago Auto Assembly plant. Some of the fuel tanks may have been manufactured with “inadequate” pressure, resulting in a. Sep 08, 2012  · A friend of mines girlfriend posted this on FB today. What does it mean, so

You might want to watch the video or read the lyrics prior to continuing on. and finding solutions could boil down to trial and error. However, it should be noted.

Download the free trial version below to get started. Double-click the downloaded file to install the software.

Latest breaking news, including politics, crime and celebrity. Find stories, updates and expert opinion.

TRIAL AND ERROR LYRICS by NIGHTINGALE: It's the way you behave and the things that you say / It'.

Nightingale Trial And Error lyrics & video : It's the way you behave and the things that you say It' the twinkle of frustration in your eyes That reveals your.

In some cases, decisions needed to be made on whether vocals or lyrics should.

RECOMMENDED: Click here to fix Windows errors and improve system performance

Categories: KB

Underlying Dbms Error Ora-00923

RECOMMENDED: If you have Windows errors then we strongly recommend that you download and run this (Windows) Repair Tool.

Install Error Title This seems a big topic, so I’ll try to clarify the procedure (19 Feb 2015) If you are getting the above error during the install of Sony Vegas ( I got it when. Title update failed to install? – Help & Support – GTAForums – Page 1 of 3 – Title update failed to install?

Oct 8, 2015. Example 1 – Bad Alias or missing Alias in tnsnames.ora file. The error message from ArcObjects is: {Underlying DBMS error[ORA-12154:.

For this I get the following error, SQL Error: ORA-00923:. ORA-00923: FROM keyword not found where expected 00923. can some one help where I am making the mistake. 0.

Experts Exchange > Questions > ORA-00923: FROM keyword not found where. Error(s), warning(s): ORA. user from one database to another user DBMS.

Mar 10, 2017. Underlying DBMS error [ORA-00923: FROM keyword not found where. Creating a composite address locator—Help | ArcGIS for Desktop.

I created a search cursor to retrieve some data from a feature class. The broken example shown below is used successfully in other scripts I created. The only.

ORA-00923 occurs when you try to execute a SELECT or REVOKE statement without a. ORA-00923 is a commonly seen error that is easily resolved by simply.

The Application Express engine is a collection of tables and packages that reside wholly within the Oracle Database user accounts APEX_050100 and FLOWS_FILES.

Learn the cause and how to resolve the ORA-00923 error message in Oracle. You tried to execute a SELECT statement, and you either missed or misplaced the FROM keyword.

Ford Taurus Fuel Error Documentation from Ford (PDF) submitted to the NHTSA said that the vehicles were all built at the company’s Chicago Auto Assembly plant. Some of the fuel tanks may have been manufactured with “inadequate” pressure, resulting in a. Sep 08, 2012  · A friend of mines girlfriend posted this on FB today. What does it mean, so

ORA-00923: FROM keyword not found where expected tips – The Oracle docs note this on the ora-00923 error*:. ORA-00923 FROM keyword not found where expected. Cause: In a SELECT or REVOKE statement, the.

3 ORA-00900 to ORA-01499 ORA-00900 invalid SQL statement. Cause: The statement is not recognized as a valid SQL statement. This error can occur if the Procedural.

However, the SQL won't run that way – I get the "ORA-00923: FROM keyword not found where expected" err msg. Statement Error ORA-00923. 0. ORA-00923:.

How strange is it (as an undergrad) to email a INDEX, or VALIDATE INDEX statement, the index name was missing or invalid. ORA-01140 cannot end online backup – all.

sql – Why am I getting "ORA-00923: FROM keyword not found where. – However, the SQL won't run that way – I get the "ORA-00923: FROM keyword not found where expected" err msg (both in Toad and when trying.

ORA-00923 FROM keyword not found where expected. Cause: In a. Action: This usually indicates an error in a tool built on top of the Oracle DBMS. Report the error to. ORA-01039 insufficient privileges on underlying objects of the view.

RECOMMENDED: Click here to fix Windows errors and improve system performance

Categories: KB

Whirlpool Gold Oven Error Code E1 F5

E1 f5 code oven

RECOMMENDED: If you have Windows errors then we strongly recommend that you download and run this (Windows) Repair Tool.

Whirlpool Range / Stove / Oven Fault Codes. Whirlpool Duet Front Loading Gas and Electric Dryer Fault Codes. F5 – E1, Self clean latch will not lock. F5 – E2.

Spss 19 Error 7001 Symptom 18 African Journal of Biotechnology – 3 April, 2012 Issue by. – Issuu is a digital publishing platform that makes it simple to publish magazines, catalogs, newspapers, books, and more online. Easily share your publications and get. Free online pharmacy compare service for consumers with many brand and generic discount drugs from USA, canadian, mexican, indian
Error Expert Crack Ransomware – It uses the.crack string to label hostage files and displays ransom. A brand new version of the Xorist crypto infection switches to using the.error[victim ID]. For ‘Fill in the Blanks’ type of questions, process of elimination is the best method. For Spot the error /Sentence Correction, speak the sentence in your mind, whichever

Hello, we have a Whirlpool oven that will no longer self clean, after the self clean is started the Error Code E1 F5 is diaplayed on the readout, I have searched the.

Hi, I just tried to clean my Whirlpool Gold Self-Cleaning 465 Oven. After I started the self clean function, an E1 F5 error code appeared on the.

Whirlpool Accubake electric oven has error message E1 F5. How do I get the oven to work again? – Answered by a verified Appliance Technician

Get shopping advice from experts, friends and the community! I have a Kenmore electric range model number 66595012100. After self cleaning, E1-FS LOCKED shows on the.

Whirlpool Oven Error Codes – What To Check – How To. – Whirlpool Oven Error Code F5 E1. Whirlpool Gold Series Refrigerator. Whirlpool Oven Error Codes – What To Check.

Whirlpool ERC Fault Codes. Many failure codes are caused by a faulty timer. Replace oven temperature sensor: F5 – E0 F5 – E1 and E2:

Sep 6, 2016. Whirlpool Oven Error Code F5 E1 (E1 F5) Reason/Condition for Error Code = Self Clean Latch Will Not Lock or Unlock Check/Troubleshoot.

Whirlpool Parts Warehouse – If It's Broke, Fix It | partswarehouse.com – Find Any Whirlpool Part In 3 Clicks! Same Day And Free Shipping Options.

Jan 16, 2013  · Discuss Whirlpool Range Fault Code F5 E1 in Oven Repair (including Ranges and Cooktops). "WHIRLPOOL FAULT CODE F5 E1. Trying to diagnosis Oven self cleaning fault.

RECOMMENDED: Click here to fix Windows errors and improve system performance

Categories: KB

Install Error Title

MacOS sierra Boot error ,Disk utility error 202 and solution

RECOMMENDED: If you have Windows errors then we strongly recommend that you download and run this (Windows) Repair Tool.

This seems a big topic, so I’ll try to clarify the procedure (19 Feb 2015) If you are getting the above error during the install of Sony Vegas ( I got it when.

Title update failed to install? – Help & Support – GTAForums – Page 1 of 3 – Title update failed to install? – posted in Help & Support:. The exe gives the regular error: Title update failed the msi gives an error that the update failed to install : I Think I know whats going on, the installer is unable to find GTA IV.

Windows Installer Error Messages. The error codes detailed in this topic are returned by the Windows Installer, Window Title: '[6]'. A system restart may be required because the file being updated is also currently in use.

Aug.2017 The day after a recent Adobe updated to a couple of programs and Creative Cloud desktop app, I received an error code 50. After a.

How to Install Bluestacks without Graphics Card – Bluestacks App Player is a great innovation in the Software field that has impressed millions of worldwide audience.

Official – WUP Installer – Title installer + Firmware. – Install public titles and spoof your firmware version to the latest (5.5.1) with Crediar's title installer! ~~ 5.4 USERS! ~~ Along with the GC to.

title=MID_Server_Installation#gsc.tab=0 2. You must validate your MID server to.

Aug 14, 2012  · Well, the title pretty much says it all. I am attempting to install Widnows 7 Ultimate 64 bit on my Lenovo D20. I only have one drive (GSkill Falcon 128GB.

Whirlpool Gold Oven Error Code E1 F5 Whirlpool Range / Stove / Oven Fault Codes. Whirlpool Duet Front Loading Gas and Electric Dryer Fault Codes. F5 – E1, Self clean latch will not lock. F5 – E2. Spss 19 Error 7001 Symptom 18 African Journal of Biotechnology – 3 April, 2012 Issue by. – Issuu is a digital publishing platform that makes
Error Expert Crack Ransomware – It uses the.crack string to label hostage files and displays ransom. A brand new version of the Xorist crypto infection switches to using the.error[victim ID]. For ‘Fill in the Blanks’ type of questions, process of elimination is the best method. For Spot the error /Sentence Correction, speak the sentence in your mind, whichever

His piece, Subtile (the mysterious title suggests a variation on the idea of subtlety. “We can perceive it as an error in the environment,” Díaz, 46, explains. That.

They believed in each other, and they believed in what we were trying to install and the program we were trying to. Elgin/Pope John coach Tina Thiele-Blecher to.

You are attempting to install Autodesk software and the install fails. During the install process you may receive the following error: Error 997. Overlapped I/O.

Upon reading the title of this tutorial, you may be wondering how the terms. In your Terminal, navigate to the project’s root folder and run pod install. Then build.

Spss 19 Error 7001 Symptom 18 African Journal of Biotechnology – 3 April, 2012 Issue by. – Issuu is a digital publishing platform that makes it simple to publish magazines, catalogs, newspapers, books, and more online. Easily share your publications and get. Free online pharmacy compare service for consumers with many brand and generic discount drugs from USA, canadian, mexican, indian

Update Title saying error–>> Failed Installing Title Update See TitleUpdate.logs And i checked the logs and is –>.

Describes a problem in which you install SQL Server 2008 or upgrade to SQL Server 2008 on a computer that is running Windows 7.

During the installation of a new Adobe Flash Player (MSI package) you receive the following error and the installation is aborted: Error 2753: The File ‘InstallAX64.

.Net Framework 3.5 fails to install with error code 0x800F081F – Original Title: Error installing.net framework 3.5 sp1 I did a refresh of my install of windows 8 pro (64 bit), because Weather and several other apps were failing.

There are few things more frustrating for a jailbreaker than needing to re-install.

As the title says. Also, I was able to install and run malwarebyte chameleon, but when it finished downloaded and was about to run malwarebytes-setup, it came up with an error message saying "Access violation at address 748BAE90.

Sep 23, 2014  · Hi! I just tried to install QlikSense Server 1.0 GA on a Win2008R2 VMWare. I can go through the setup-steps (tried both: Quick and Custom Installation),

RECOMMENDED: Click here to fix Windows errors and improve system performance

Categories: KB