RECOMMENDED: If you have Windows errors then we strongly recommend that you download and run this (Windows) Repair Tool.

Error 497 Samsung Galaxy Ace Jun 30, 2016. Samsung S5838 Galaxy Ace, Get USB Driver. Samsung N7100. Samsung Galaxy Tab 2 10.1 (SGH-I497), Get USB Driver. Samsung Galaxy. 2343 Internal Error Identification of nonlinear Hammerstein models has received much attention due to its ability to describe a wide variety of nonlinear systems. This paper considers. Dec 07, 2012  · The certificate

LTIB on Ubuntu 12.04 | NXP Community – Hello, I was trying to install an the LTIB on Ubuntu 12.04. I have got. make: *** [ busybox_unstripped] Error 1. I assume you are compiling under Ubuntu 12.

ePub opens in Archive Manager The reason for this unexpected error was that the downloaded eBook was in ePub format and Ubuntu’s default Document Viewer doesn’t support ePub format. So the question arises, how to read ePub books.

This page describes how to install pcl-trunk on an Ubuntu 12.04 LTS 64bit machine. It was tested most recently with pcl trunk a504a690 on 11/13/13.

I created and tested this script using a fresh install of Ubuntu 12.04. to create your first user. Once you have created a user account you can then login and you will have a great looking Graylog2 web ui like below. If you get a ruby error.

/srv/irclogs.ubuntu.com/2007/12/18/#ubuntu+1.txt. You would need to work out how often things are run to make a sane decision as of what. Error: microcode.

Provides package information from the official Ubuntu Package archive. Packages can be browsed by their contents and by selected criteria.

MATLAB – Community Help Wiki – Official Ubuntu Documentation – Oct 30, 2015. Make a MATLAB specific bin directory for gcc symlink. If you have Ubuntu 12.04 you like get the following error when running Matlab.

— Mercurial was not found. CMake Error at. 'make' to build the rest of LLVM tools. changed title to cmake errors on ubuntu 12.04 x86_64; edited.

For instance, servers use error. to create a server. Since Ubuntu Server and Desktop share a core Ubuntu kernel, default installation differences don’t preclude future software package installs. Similarly, support shifted with the release.

Wolfenstein 2009 Sp Error The biggest totally free game fix & trainer library online for PC Games [https://gamecopyworld.com] Wolfenstein® II: The New Colossus™ is the highly anticipated sequel to the critically acclaimed first-person shooter, Wolfenstein®: The New Order™ developed by. When setting up SQL Server replication you might see an error message from the Transactional Replication Log Reader Agent
Mac Os Error 8796 i have a mac 10.5.8. Forums Mac Help Forums Mac OS X System & Mac Software. cannot burn dvds: error code -8796 After the project is done encoding, I keep receiving the message "cannnot record disc because of mac os error result code -8796". anyone have a similar problem or a guess as to what

You can install OpenCV from the Ubuntu or Debian repository or from the official site. mkdir build && cd build && cmake. && make. Finally, run the demo:./ demo. make[1]: *** [modules/highgui/CMakeFiles/opencv_highgui.dir/all] Error 2.

Before installing NS2 you need to install few other applications to make it work. Note: Use LTS. I got an NS2.35 installation error in Ubuntu 12.10. What is the. Zheng Luo, OIer from 12 to 18, undergraduate CS student. Answered Mar 8.

ERROR No response from remote host (Nagios /. – Are you a mostly Windows admin and using your mediocre Linux skills to setup a Nagios 3.x server running on Ubuntu 10.04 using the Centreon 2.3.x UI for configuration?

/srv/irclogs.ubuntu.com/2012/10/12/#ubuntu+1.txt. Hey guys I'm running 12.10 and I'm having issues with my. I'd google the exact error msg to find a solution:

gyp ERR! stack Error: make failed with exit code: 2 gyp ERR! stack at. ChildProcess.handle.onexit (childprocess.js:809:12) gyp ERR! System.

I’m posting here a running (base) version of ubuntu 12.10 armhf (V1), kernel 3.0.42+. Quick, Working and not so Dirty EDITION. Easy to install on the NAND and ready.

Jan 7, 2016. For example, on Ubuntu based Linux systems you can write the following. In this case, the make command should have created an uninstall profile for you. Hi!! i got the following error while installing opencv 3.1.0. it is the error that comes. Also I have not tested on Ubuntu 12 so I can't say for sure.

The Ubuntu development community lets off the brakes a little and sticks some shiny back in. Ubuntu 12.10 is no exception, so make no mistake—there’s some. Yet there we were, staring at an error message telling us there would.

RECOMMENDED: Click here to fix Windows errors and improve system performance